{"text_format":"1","workbook":"xlsx","n_sheets":2,"sheets":["RF","Dados"],"not_rendered":{"charts":0,"images":3,"macros":1,"external_links":0,"defined_names":4,"comments":0,"pivot_tables":0},"unopened":[],"bounds":{"document_bytes":16777216,"sheet_cells":100000,"rows_first":2000,"rows_last":500,"rows_between":2000,"halvings":0,"cell_chars":16384,"cell_head_chars":4096},"cells_cut":0,"cells_raw":0,"read":"whole","date_system":"1900"}

{"sheet":"RF","index":0,"n_rows":96,"n_cols":39,"rows_kept":96,"cut":false,"hidden":false,"merged":[[70,6,70,37],[54,32,54,37],[56,6,56,25],[56,32,56,37],[90,4,90,14],[58,6,58,25],[58,32,58,37],[62,6,62,25],[62,32,62,37],[60,6,60,25],[60,32,60,37],[71,7,71,36],[79,2,79,15],[79,17,79,37],[86,4,86,14],[87,4,87,14],[88,4,88,14],[89,4,89,14],[84,19,84,37],[86,18,86,36],[87,18,87,36],[84,4,84,14],[11,28,13,37],[38,6,38,37],[40,6,40,10],[40,14,40,37],[29,6,29,10],[29,14,29,37],[33,6,33,23],[33,28,33,37],[31,6,31,10],[31,19,31,23],[15,2,15,37],[21,6,21,37],[25,6,25,37],[27,6,27,14],[27,20,27,22],[27,24,27,25],[95,2,95,37],[73,2,73,18],[75,2,75,19],[42,6,42,37],[46,6,46,37],[52,6,52,37],[64,6,64,37],[48,6,48,10],[50,6,50,10],[50,11,50,37],[44,6,44,37],[54,6,54,25],[91,4,91,14],[81,19,82,37],[91,18,91,36],[85,4,85,14],[48,21,48,25],[27,27,27,37],[19,6,19,37],[23,6,23,14],[23,20,23,25]]}
[]
[]
[]
[]
[]
[null,null,null,null,null,null,null,null,null,null,null,null,null,null,null,null,null,null,null,null,null,null,null,null,null,null,null,null,null,null,null,null,null,null,null,null,null,"Ações de Curta Duração"]
[]
[null,null,null,null,null,null,null,null,null,null,null,null,null,null,null,null,null,null,null,null,null,null,null,null,null,null,null,null,null,null,null,null,null,null,null,null,null,"Requerimento de Reconhecimento e Certificação"]
[]
[null,null,null,null,null,null,null,null,null,null,null,null,null,null,null,null,null,null,null,null,null,null,null,null,null,null,null,null,null,null,null,null,null,null,null,null,null,"(Despacho n.º 5741/2015)"]
[]
[null,null,null,null,null,null,null,null,null,null,null,null,null,null,"Registo de Entrada (Data e Rubrica):",null,null,null,null,null,null,null,null,null,null,null,null,null,"Registo de Reconhecimento:"]
[]
[]
[]
[null,null,"Exmo. Senhor\nDiretor do Centro de Formação Sá de Miranda\n\nNos termos do Art.º 5.º, ponto 2 do Despacho n.º 5741/2015, de 29 de Maio, venho requerer o reconhecimento e certificação da atividade de formação abaixo descrita, que entendo configurar a modalidade de Ação de Curta Duração, para os efeitos previstos na legislação em vigor no âmbito da formação contínua de Pessoal Docente."]
[]
[null,null,"1 • REQUERIMENTO APRESENTADO POR:"]
[]
[null,null,null,null,null,"Requerente:",null,null,null,null,null,null,null,null,null,null,null,null,null,null,null,null,null,null,null,null,null,null,null,null,null,null,null,null,null,null,null,null,{"$f":"IF(G20=\"Docente, a título individual\",1,IF(G20=\"Diretor(a) de escola/agrupamento, para o conjunto de participantes\",2,\"\"))","v":""}]
[]
[null,null,null,null,null,"Nome:"]
[]
[null,null,null,null,null,"N.º CC:",null,null,null,null,null,null,null,null,null,null,null,null,null,"NIF:"]
[]
[null,null,null,null,null,"Morada:"]
[]
[null,null,null,null,null,"Localidade:",null,null,null,null,null,null,null,null,null,null,null,null,null,"Código Postal:"]
[]
[null,null,null,null,null,"Telemóvel:",null,null,null,null,null,null,null,"E-mail:"]
[]
[null,null,null,null,null,"Grupo de Recrutamento:","<selecione>",null,null,null,null,null,null,null,null,null,null,null,"Grupo de Lecionação:","<selecione>"]
[]
[null,null,null,null,null," Escola/Agrup:",null,null,null,null,null,null,null,null,null,null,null,null,null,null,null,null,null,null,null,null,null,"Localidade:",{"$f":"IF(OR(G34=\"<selecione>\",G34=\"\"),\"\",VLOOKUP(G34,Dados!G3:I10,3,0))","v":""}]
[]
[]
[null,null,"2 • CARATERIZAÇÃO DA AÇÃO:"]
[]
[null,null,null,null,null,"Designação:"]
[]
[null,null,null,null,null,"Formato:",null,null,null,null,null,null,null,"Qual?"]
[]
[null,null,null,null,null,"Conteúdos:"]
[]
[null,null,null,null,null,"Área:"]
[]
[null,null,null,null,null,"Destinatários:"]
[]
[null,null,null,null,null,"Data de Início:",null,null,null,null,null,"(dd-mm-aaaa)",null,null,null,null,null,null,null,null,"Data de Fim:",null,null,null,null,null,"(dd-mm-aaaa)",null,null,null,"Erro nas datas!"]
[]
[null,null,null,null,null,"Total de horas:",null,null,null,null,null,{"$f":"IF(G51=\"\",\"\",IF(OR(G51<3,G51>6),\" > Formação com menos de 3 ou mais de 6 horas não pode ser certificada como ACD!\",\"\"))","v":""}]
[]
[null,null,null,null,null,"Local de Realização:"]
[]
[null,null,null,null,null,"Formador 1:",null,null,null,null,null,null,null,null,null,null,null,null,null,null,null,null,null,null,null,null,null,null,null,null,null,"Grau Académico:","<selecione>"]
[]
[null,null,null,null,null,"Formador 2:",null,null,null,null,null,null,null,null,null,null,null,null,null,null,null,null,null,null,null,null,null,null,null,null,null,"Grau Académico:","<selecione>"]
[]
[null,null,null,null,null,"Formador 3:",null,null,null,null,null,null,null,null,null,null,null,null,null,null,null,null,null,null,null,null,null,null,null,null,null,"Grau Académico:","<selecione>"]
[]
[null,null,null,null,null,"Formador 4:",null,null,null,null,null,null,null,null,null,null,null,null,null,null,null,null,null,null,null,null,null,null,null,null,null,"Grau Académico:","<selecione>"]
[]
[null,null,null,null,null,"Formador 5:",null,null,null,null,null,null,null,null,null,null,null,null,null,null,null,null,null,null,null,null,null,null,null,null,null,"Grau Académico:","<selecione>"]
[]
[null,null,null,null,null,"Entidade promotora:","<selecione ou escreva>"]
[]
[null,null,{"$f":"IF(AM20=1,\"3 • ANEXAR: Programa temático da ação e comprovativo de presença\",IF(AM20=2,\"3 • ANEXAR: Programa temático da ação, listagem de participantes e respetivos comprovativos de presença\",\"\"))","v":""}]
[]
[null,null,"4 • FORMAÇÃO “NA DIMENSÃO CIENTÍFICA E PEDAGÓGICA”"]
[]
[null,null,null,null,null," Parecer do Coordenador de Departamento:","Confirmo que os conteúdos desta ação têm uma relação direta com os conteúdos científicos integrados nos curricula do(s) grupo(s) de recrutamento ou de lecionação..................................., pelo que deverá ser considerada para os efeitos referidos no artigo 9.º do Decreto-lei n.º 22/2014."]
[null,null,null,null,null,null,null,"Assinatura(s) do(s) Coordenador(es) de Departamento"]
[]
[null,null,{"$f":"IF(AC34=\"\",\"\",AC34&\" | \"&TEXT(TODAY(),\"dd.mmmm.aaaa\"))","v":""}]
[null,null,{"$f":"IF(AM20<>2,\"O docente,\",IF(AM20=2,\"O(A) Diretor(a) do \"&G34,\"\"))","v":"O docente,"}]
[]
[null,null,"(Imprimir e assinar)"]
[]
[]
[null,null,"Parecer do Diretor do CF Sá de Miranda",null,null,null,null,null,null,null,null,null,null,null,null,null,null,"Decisão do Conselho de Diretores"]
[]
[null,null,null,null," A ação cumpre todos o requisitos para ser reconhecida como ACD.",null,null,null,null,null,null,null,null,null,null,null,null,null,null,"Todos os membros manifestaram, por mail, a sua concordância com o parecer do diretor do CFSM (ver anexos)."]
[]
[null,null,null,null," A ação não cumpre os seguintes requisitos:"]
[null,null,null,null,null,null,null,null,null,null,null,null,null,null,null,null,null,null,null,"Decisão tomada em reunião de Conselho de Diretores, de _______ /_______ 20 ____ ."]
[]
[null,null,null,null,null,null,null,null,null,null,null,null,null,null,null,null,null,null,"•"]
[null,null,null,null,null,null,null,null,null,null,null,null,null,null,null,null,null,null,"O requerimento foi deferido/indeferido (cortar o que não interessa)"]
[]
[null,null,null,null,null,null,null,null,null,null,null,null,null,null,null,null,null,null,"Data: "]
[]
[]
[null,null,null,null,"Diretor do CF Sá de Miranda",null,null,null,null,null,null,null,null,null,null,null,null,null,"Presidente do Conselho de Diretores"]
[]
[]
[null,null,"Centro de Formação Sá de Miranda • Rua Dr. Domingos Soares • 4710–295 BRAGA • Tel. 253200985 • Fax. 253200986 • E-mail: cf.sa.miranda@sa-miranda.net"]

{"sheet":"Dados","index":1,"n_rows":84,"n_cols":17,"rows_kept":84,"cut":false,"hidden":true,"merged":[]}
[null,"Entidade_Promotora","Destinatários","FormEspecífica","Áreas","Grupo","Designação_Escola","Código_Escola","Localidade_Escola","HabilitaçõesFormador","Situação Prof.","Escalões","Nível Ensino",null,"Tipo de Requerente","Formato","TipoRequerimento"]
[null,"<selecione ou escreva>","<selecione ou escreva>","<selecione>","<selecione área>","<selecione>","<selecione>","<selecione>",null,"<selecione>","<selecione>","<selecione>","<selecione>",null,"<selecione>","<selecione>","<selecione>"]
[null,"Agrupamento de Escolas Carlos Amarante","Coordenadores de departamento","Requere-se, ainda, que a presente atividade formativa seja considerada para os efeitos referidos no artigo 9.º do Decreto-lei n.º 22/2014","A - Área da docência, ou seja, áreas do conhecimento que constituem matérias curriculares nos vários níveis de ensino",100,"Agrupamento de Escolas Carlos Amarante",150149,"Braga","Mestrado","Quadro de Agrupamento","S/escalão","Pré - Escolar",null,"Docente – a título individual","Seminário","Docente, a título individual"]
[null,"Agrupamento de Escolas de P. de Lanhoso","Diretores de Escola/Agrupamento","Não se requer que a presente atividade formativa seja considerada para os efeitos referidos no artigo 9.º do Decreto-lei n.º 22/2014","B - Prática pedagógica e didática na docência, designadamente a formação no domínio da organização e gestão da sala de aula",110,"Agrupamento de Escolas de P. de Lanhoso",150915,"Póvoa de Lanhoso","Doutoramento","Quadro de Escola","1.º","1.º Ciclo",null,"Diretor(a) – a título coletivo","Conferência","Diretor(a) de escola/agrupamento, para o conjunto de participantes"]
[null,"Agrupamento de Escolas Dr. Francisco Sanches","Diretores de turma",null,"C - Formação educacional geral e das organizações educativas",120,"Agrupamento de Escolas Dr. Francisco Sanches",150988,"Braga",null,"Quadro de Zona Pedagógica","2.º","2.º Ciclo",null,"CFSM","Simpósio"]
[null,"Agrupamento de Escolas Gonçalo Sampaio","Docentes de todos os grupos de recrutamento",null,"D - Administração escolar e administração educacional",200,"Agrupamento de Escolas Gonçalo Sampaio",150320,"Póvoa de Lanhoso",null,"Contrato a Termo Resolutivo Certo","3.º","3.º Ciclo",null,null,"Jornada"]
[null,"Agrupamento de Escolas Sá de Miranda","Docentes dos grupos: <especificar>",null,"E - Liderança, coordenação e supervisão pedagógica",210,"Agrupamento de Escolas Sá de Miranda",150241,"Braga",null,null,"4.º","Secundário",null,null,"Outro…"]
[null,"Agrupamento de Escolas Vieira de Araújo ","Membros da direção de Escola/Agrupamento",null,"F - Formação ética e deontológica",220,"Agrupamento de Escolas Vieira de Araújo ",150605,"Vieira do Minho",null,null,"5.º"]
[null,"Conservatório de Música de Calouste Gulbenkian","Professores bibliotecários",null,"G - Tecnologias da informação e comunicação aplicadas a didáticas específicas ou à gestão escolar",230,"Conservatório de Música de Calouste Gulbenkian",404251,"Braga",null,null,"6.º"]
[null,"Colégio Teresiano",null,null,null,240,"Colégio Teresiano",303517,"Braga",null,null,"7.º"]
[null,null,null,null,null,250,null,null,null,null,null,"8.º"]
[null,null,null,null,null,260,null,null,null,null,null,"9.º"]
[null,null,null,null,null,290,null,null,null,null,null,"10.º"]
[null,null,null,null,null,300]
[null,null,null,null,null,310]
[null,null,null,null,null,320]
[null,null,null,null,null,330]
[null,null,null,null,null,340]
[null,null,null,null,null,350]
[null,null,null,null,null,400]
[null,null,null,null,null,410]
[null,null,null,null,null,420]
[null,null,null,null,null,430]
[null,null,null,null,null,500]
[null,null,null,null,null,510]
[null,null,null,null,null,520]
[null,null,null,null,null,530]
[null,null,null,null,null,540]
[null,null,null,null,null,550]
[null,null,null,null,null,560]
[null,null,null,null,null,600]
[null,null,null,null,null,610]
[null,null,null,null,null,620]
[null,null,null,null,null,910]
[null,null,null,null,null,920]
[null,null,null,null,null,930]
[null,null,null,null,null,997]
[null,null,null,null,null,998]
[null,null,null,null,null,999]
[null,null,null,null,null,"D01"]
[null,null,null,null,null,"D02"]
[null,null,null,null,null,"D03"]
[null,null,null,null,null,"D04"]
[null,null,null,null,null,"D05"]
[null,null,null,null,null,"D06"]
[null,null,null,null,null,"D07"]
[null,null,null,null,null,"D08"]
[null,null,null,null,null,"D09"]
[null,null,null,null,null,"M01"]
[null,null,null,null,null,"M02"]
[null,null,null,null,null,"M03"]
[null,null,null,null,null,"M04"]
[null,null,null,null,null,"M05"]
[null,null,null,null,null,"M06"]
[null,null,null,null,null,"M07"]
[null,null,null,null,null,"M08"]
[null,null,null,null,null,"M09"]
[null,null,null,null,null,"M10"]
[null,null,null,null,null,"M11"]
[null,null,null,null,null,"M12"]
[null,null,null,null,null,"M13"]
[null,null,null,null,null,"M14"]
[null,null,null,null,null,"M15"]
[null,null,null,null,null,"M16"]
[null,null,null,null,null,"M17"]
[null,null,null,null,null,"M18"]
[null,null,null,null,null,"M19"]
[null,null,null,null,null,"M20"]
[null,null,null,null,null,"M21"]
[null,null,null,null,null,"M22"]
[null,null,null,null,null,"M23"]
[null,null,null,null,null,"M24"]
[null,null,null,null,null,"M25"]
[null,null,null,null,null,"M26"]
[null,null,null,null,null,"M27"]
[null,null,null,null,null,"M28"]
[null,null,null,null,null,"M29"]
[null,null,null,null,null,"M30"]
[null,null,null,null,null,"M31"]
[null,null,null,null,null,"M32"]
[null,null,null,null,null,"M33"]
[null,null,null,null,null,"M34"]
[null,null,null,null,null,"M35"]
[null,null,null,null,null,"M36"]